{"text_format":"1","workbook":"xlsx","n_sheets":4,"sheets":["名簿","システム取込用","全学団体","医学部団体"],"not_rendered":{"charts":0,"images":0,"macros":1,"external_links":0,"defined_names":19,"comments":0,"pivot_tables":0},"unopened":[],"bounds":{"document_bytes":16777216,"sheet_cells":100000,"rows_first":2000,"rows_last":500,"rows_between":2000,"halvings":0,"cell_chars":16384,"cell_head_chars":4096},"cells_cut":0,"cells_raw":0,"read":"whole","date_system":"1900"}

{"sheet":"名簿","index":0,"n_rows":262,"n_cols":6,"rows_kept":262,"cut":false,"hidden":false,"merged":[[5,1,5,3],[4,1,4,3],[3,1,3,3],[1,1,1,3],[8,1,8,3],[2,1,2,3]]}
["継続団体"]
["所属","松本キャンパス"]
["全学・医学"]
["学友会の所属"]
["活動区分"]
["団体名"]
[]
["新規団体"]
["団体名"]
[]
["所属学生名簿"]
["団体名（自動入力）","コード（自動入力）","学籍番号","氏名","年度（自動入力）","番号"]
[{"$f":"IF(C13<>\"\", $B$6&$B$9, \"\")","v":""},{"$f":"IF(C13<>\"\", IFERROR(VLOOKUP($B$6,全学団体!$E$2:$F$161,2,FALSE), IFERROR(VLOOKUP($B$6,医学部団体!$E$2:$F$47,2,FALSE), 0)), \"\")","v":""},null,null,{"$f":"IF(C13<>\"\", 2026, \"\")","v":""},1]
[{"$f":"IF(C14<>\"\", $B$6&$B$9, \"\")","v":""},{"$f":"IF(C14<>\"\", IFERROR(VLOOKUP($B$6,全学団体!$E$2:$F$161,2,FALSE), IFERROR(VLOOKUP($B$6,医学部団体!$E$2:$F$47,2,FALSE), 0)), \"\")","v":""},null,null,"",2]
[{"$f":"IF(C15<>\"\", $B$6&$B$9, \"\")","v":""},{"$f":"IF(C15<>\"\", IFERROR(VLOOKUP($B$6,全学団体!$E$2:$F$161,2,FALSE), IFERROR(VLOOKUP($B$6,医学部団体!$E$2:$F$47,2,FALSE), 0)), \"\")","v":""},null,null,"",3]
[{"$f":"IF(C16<>\"\", $B$6&$B$9, \"\")","v":""},{"$f":"IF(C16<>\"\", IFERROR(VLOOKUP($B$6,全学団体!$E$2:$F$161,2,FALSE), IFERROR(VLOOKUP($B$6,医学部団体!$E$2:$F$47,2,FALSE), 0)), \"\")","v":""},null,null,"",4]
[{"$f":"IF(C17<>\"\", $B$6&$B$9, \"\")","v":""},{"$f":"IF(C17<>\"\", IFERROR(VLOOKUP($B$6,全学団体!$E$2:$F$161,2,FALSE), IFERROR(VLOOKUP($B$6,医学部団体!$E$2:$F$47,2,FALSE), 0)), \"\")","v":""},null,null,"",5]
[{"$f":"IF(C18<>\"\", $B$6&$B$9, \"\")","v":""},{"$f":"IF(C18<>\"\", IFERROR(VLOOKUP($B$6,全学団体!$E$2:$F$161,2,FALSE), IFERROR(VLOOKUP($B$6,医学部団体!$E$2:$F$47,2,FALSE), 0)), \"\")","v":""},null,null,"",6]
["",{"$f":"IF(C19<>\"\", IFERROR(VLOOKUP($B$6,全学団体!$E$2:$F$161,2,FALSE), IFERROR(VLOOKUP($B$6,医学部団体!$E$2:$F$47,2,FALSE), 0)), \"\")","v":""},null,null,"",7]
["",{"$f":"IF(C20<>\"\", IFERROR(VLOOKUP($B$6,全学団体!$E$2:$F$161,2,FALSE), IFERROR(VLOOKUP($B$6,医学部団体!$E$2:$F$47,2,FALSE), 0)), \"\")","v":""},null,null,"",8]
["",{"$f":"IF(C21<>\"\", IFERROR(VLOOKUP($B$6,全学団体!$E$2:$F$161,2,FALSE), IFERROR(VLOOKUP($B$6,医学部団体!$E$2:$F$47,2,FALSE), 0)), \"\")","v":""},null,null,"",9]
["",{"$f":"IF(C22<>\"\", IFERROR(VLOOKUP($B$6,全学団体!$E$2:$F$161,2,FALSE), IFERROR(VLOOKUP($B$6,医学部団体!$E$2:$F$47,2,FALSE), 0)), \"\")","v":""},null,null,"",10]
["",{"$f":"IF(C23<>\"\", IFERROR(VLOOKUP($B$6,全学団体!$E$2:$F$161,2,FALSE), IFERROR(VLOOKUP($B$6,医学部団体!$E$2:$F$47,2,FALSE), 0)), \"\")","v":""},null,null,"",11]
["",{"$f":"IF(C24<>\"\", IFERROR(VLOOKUP($B$6,全学団体!$E$2:$F$161,2,FALSE), IFERROR(VLOOKUP($B$6,医学部団体!$E$2:$F$47,2,FALSE), 0)), \"\")","v":""},null,null,"",12]
["",{"$f":"IF(C25<>\"\", IFERROR(VLOOKUP($B$6,全学団体!$E$2:$F$161,2,FALSE), IFERROR(VLOOKUP($B$6,医学部団体!$E$2:$F$47,2,FALSE), 0)), \"\")","v":""},null,null,"",13]
["",{"$f":"IF(C26<>\"\", IFERROR(VLOOKUP($B$6,全学団体!$E$2:$F$161,2,FALSE), IFERROR(VLOOKUP($B$6,医学部団体!$E$2:$F$47,2,FALSE), 0)), \"\")","v":""},null,null,"",14]
["",{"$f":"IF(C27<>\"\", IFERROR(VLOOKUP($B$6,全学団体!$E$2:$F$161,2,FALSE), IFERROR(VLOOKUP($B$6,医学部団体!$E$2:$F$47,2,FALSE), 0)), \"\")","v":""},null,null,"",15]
["",{"$f":"IF(C28<>\"\", IFERROR(VLOOKUP($B$6,全学団体!$E$2:$F$161,2,FALSE), IFERROR(VLOOKUP($B$6,医学部団体!$E$2:$F$47,2,FALSE), 0)), \"\")","v":""},null,null,"",16]
["",{"$f":"IF(C29<>\"\", IFERROR(VLOOKUP($B$6,全学団体!$E$2:$F$161,2,FALSE), IFERROR(VLOOKUP($B$6,医学部団体!$E$2:$F$47,2,FALSE), 0)), \"\")","v":""},null,null,"",17]
["",{"$f":"IF(C30<>\"\", IFERROR(VLOOKUP($B$6,全学団体!$E$2:$F$161,2,FALSE), IFERROR(VLOOKUP($B$6,医学部団体!$E$2:$F$47,2,FALSE), 0)), \"\")","v":""},null,null,"",18]
["",{"$f":"IF(C31<>\"\", IFERROR(VLOOKUP($B$6,全学団体!$E$2:$F$161,2,FALSE), IFERROR(VLOOKUP($B$6,医学部団体!$E$2:$F$47,2,FALSE), 0)), \"\")","v":""},null,null,"",19]
["",{"$f":"IF(C32<>\"\", IFERROR(VLOOKUP($B$6,全学団体!$E$2:$F$161,2,FALSE), IFERROR(VLOOKUP($B$6,医学部団体!$E$2:$F$47,2,FALSE), 0)), \"\")","v":""},null,null,"",20]
["",{"$f":"IF(C33<>\"\", IFERROR(VLOOKUP($B$6,全学団体!$E$2:$F$161,2,FALSE), IFERROR(VLOOKUP($B$6,医学部団体!$E$2:$F$47,2,FALSE), 0)), \"\")","v":""},null,null,"",21]
["",{"$f":"IF(C34<>\"\", IFERROR(VLOOKUP($B$6,全学団体!$E$2:$F$161,2,FALSE), IFERROR(VLOOKUP($B$6,医学部団体!$E$2:$F$47,2,FALSE), 0)), \"\")","v":""},null,null,"",22]
["",{"$f":"IF(C35<>\"\", IFERROR(VLOOKUP($B$6,全学団体!$E$2:$F$161,2,FALSE), IFERROR(VLOOKUP($B$6,医学部団体!$E$2:$F$47,2,FALSE), 0)), \"\")","v":""},null,null,"",23]
["",{"$f":"IF(C36<>\"\", IFERROR(VLOOKUP($B$6,全学団体!$E$2:$F$161,2,FALSE), IFERROR(VLOOKUP($B$6,医学部団体!$E$2:$F$47,2,FALSE), 0)), \"\")","v":""},null,null,"",24]
["",{"$f":"IF(C37<>\"\", IFERROR(VLOOKUP($B$6,全学団体!$E$2:$F$161,2,FALSE), IFERROR(VLOOKUP($B$6,医学部団体!$E$2:$F$47,2,FALSE), 0)), \"\")","v":""},null,null,"",25]
["",{"$f":"IF(C38<>\"\", IFERROR(VLOOKUP($B$6,全学団体!$E$2:$F$161,2,FALSE), IFERROR(VLOOKUP($B$6,医学部団体!$E$2:$F$47,2,FALSE), 0)), \"\")","v":""},null,null,"",26]
["",{"$f":"IF(C39<>\"\", IFERROR(VLOOKUP($B$6,全学団体!$E$2:$F$161,2,FALSE), IFERROR(VLOOKUP($B$6,医学部団体!$E$2:$F$47,2,FALSE), 0)), \"\")","v":""},null,null,"",27]
["",{"$f":"IF(C40<>\"\", IFERROR(VLOOKUP($B$6,全学団体!$E$2:$F$161,2,FALSE), IFERROR(VLOOKUP($B$6,医学部団体!$E$2:$F$47,2,FALSE), 0)), \"\")","v":""},null,null,"",28]
["",{"$f":"IF(C41<>\"\", IFERROR(VLOOKUP($B$6,全学団体!$E$2:$F$161,2,FALSE), IFERROR(VLOOKUP($B$6,医学部団体!$E$2:$F$47,2,FALSE), 0)), \"\")","v":""},null,null,"",29]
["",{"$f":"IF(C42<>\"\", IFERROR(VLOOKUP($B$6,全学団体!$E$2:$F$161,2,FALSE), IFERROR(VLOOKUP($B$6,医学部団体!$E$2:$F$47,2,FALSE), 0)), \"\")","v":""},null,null,"",30]
["",{"$f":"IF(C43<>\"\", IFERROR(VLOOKUP($B$6,全学団体!$E$2:$F$161,2,FALSE), IFERROR(VLOOKUP($B$6,医学部団体!$E$2:$F$47,2,FALSE), 0)), \"\")","v":""},null,null,"",31]
["",{"$f":"IF(C44<>\"\", IFERROR(VLOOKUP($B$6,全学団体!$E$2:$F$161,2,FALSE), IFERROR(VLOOKUP($B$6,医学部団体!$E$2:$F$47,2,FALSE), 0)), \"\")","v":""},null,null,"",32]
["",{"$f":"IF(C45<>\"\", IFERROR(VLOOKUP($B$6,全学団体!$E$2:$F$161,2,FALSE), IFERROR(VLOOKUP($B$6,医学部団体!$E$2:$F$47,2,FALSE), 0)), \"\")","v":""},null,null,{"$f":"IF(C45<>\"\", 2026, \"\")","v":""},33]
["",{"$f":"IF(C46<>\"\", IFERROR(VLOOKUP($B$6,全学団体!$E$2:$F$161,2,FALSE), IFERROR(VLOOKUP($B$6,医学部団体!$E$2:$F$47,2,FALSE), 0)), \"\")","v":""},null,null,"",34]
["",{"$f":"IF(C47<>\"\", IFERROR(VLOOKUP($B$6,全学団体!$E$2:$F$161,2,FALSE), IFERROR(VLOOKUP($B$6,医学部団体!$E$2:$F$47,2,FALSE), 0)), \"\")","v":""},null,null,"",35]
["",{"$f":"IF(C48<>\"\", IFERROR(VLOOKUP($B$6,全学団体!$E$2:$F$161,2,FALSE), IFERROR(VLOOKUP($B$6,医学部団体!$E$2:$F$47,2,FALSE), 0)), \"\")","v":""},null,null,"",36]
["",{"$f":"IF(C49<>\"\", IFERROR(VLOOKUP($B$6,全学団体!$E$2:$F$161,2,FALSE), IFERROR(VLOOKUP($B$6,医学部団体!$E$2:$F$47,2,FALSE), 0)), \"\")","v":""},null,null,"",37]
["",{"$f":"IF(C50<>\"\", IFERROR(VLOOKUP($B$6,全学団体!$E$2:$F$161,2,FALSE), IFERROR(VLOOKUP($B$6,医学部団体!$E$2:$F$47,2,FALSE), 0)), \"\")","v":""},null,null,"",38]
["",{"$f":"IF(C51<>\"\", IFERROR(VLOOKUP($B$6,全学団体!$E$2:$F$161,2,FALSE), IFERROR(VLOOKUP($B$6,医学部団体!$E$2:$F$47,2,FALSE), 0)), \"\")","v":""},null,null,"",39]
["",{"$f":"IF(C52<>\"\", IFERROR(VLOOKUP($B$6,全学団体!$E$2:$F$161,2,FALSE), IFERROR(VLOOKUP($B$6,医学部団体!$E$2:$F$47,2,FALSE), 0)), \"\")","v":""},null,null,"",40]
["",{"$f":"IF(C53<>\"\", IFERROR(VLOOKUP($B$6,全学団体!$E$2:$F$161,2,FALSE), IFERROR(VLOOKUP($B$6,医学部団体!$E$2:$F$47,2,FALSE), 0)), \"\")","v":""},null,null,"",41]
["",{"$f":"IF(C54<>\"\", IFERROR(VLOOKUP($B$6,全学団体!$E$2:$F$161,2,FALSE), IFERROR(VLOOKUP($B$6,医学部団体!$E$2:$F$47,2,FALSE), 0)), \"\")","v":""},null,null,"",42]
["",{"$f":"IF(C55<>\"\", IFERROR(VLOOKUP($B$6,全学団体!$E$2:$F$161,2,FALSE), IFERROR(VLOOKUP($B$6,医学部団体!$E$2:$F$47,2,FALSE), 0)), \"\")","v":""},null,null,"",43]
["",{"$f":"IF(C56<>\"\", IFERROR(VLOOKUP($B$6,全学団体!$E$2:$F$161,2,FALSE), IFERROR(VLOOKUP($B$6,医学部団体!$E$2:$F$47,2,FALSE), 0)), \"\")","v":""},null,null,"",44]
["",{"$f":"IF(C57<>\"\", IFERROR(VLOOKUP($B$6,全学団体!$E$2:$F$161,2,FALSE), IFERROR(VLOOKUP($B$6,医学部団体!$E$2:$F$47,2,FALSE), 0)), \"\")","v":""},null,null,"",45]
["",{"$f":"IF(C58<>\"\", IFERROR(VLOOKUP($B$6,全学団体!$E$2:$F$161,2,FALSE), IFERROR(VLOOKUP($B$6,医学部団体!$E$2:$F$47,2,FALSE), 0)), \"\")","v":""},null,null,"",46]
["",{"$f":"IF(C59<>\"\", IFERROR(VLOOKUP($B$6,全学団体!$E$2:$F$161,2,FALSE), IFERROR(VLOOKUP($B$6,医学部団体!$E$2:$F$47,2,FALSE), 0)), \"\")","v":""},null,null,"",47]
["",{"$f":"IF(C60<>\"\", IFERROR(VLOOKUP($B$6,全学団体!$E$2:$F$161,2,FALSE), IFERROR(VLOOKUP($B$6,医学部団体!$E$2:$F$47,2,FALSE), 0)), \"\")","v":""},null,null,"",48]
["",{"$f":"IF(C61<>\"\", IFERROR(VLOOKUP($B$6,全学団体!$E$2:$F$161,2,FALSE), IFERROR(VLOOKUP($B$6,医学部団体!$E$2:$F$47,2,FALSE), 0)), \"\")","v":""},null,null,"",49]
["",{"$f":"IF(C62<>\"\", IFERROR(VLOOKUP($B$6,全学団体!$E$2:$F$161,2,FALSE), IFERROR(VLOOKUP($B$6,医学部団体!$E$2:$F$47,2,FALSE), 0)), \"\")","v":""},null,null,"",50]
["",{"$f":"IF(C63<>\"\", IFERROR(VLOOKUP($B$6,全学団体!$E$2:$F$161,2,FALSE), IFERROR(VLOOKUP($B$6,医学部団体!$E$2:$F$47,2,FALSE), 0)), \"\")","v":""},null,null,"",51]
["",{"$f":"IF(C64<>\"\", IFERROR(VLOOKUP($B$6,全学団体!$E$2:$F$161,2,FALSE), IFERROR(VLOOKUP($B$6,医学部団体!$E$2:$F$47,2,FALSE), 0)), \"\")","v":""},null,null,"",52]
["",{"$f":"IF(C65<>\"\", IFERROR(VLOOKUP($B$6,全学団体!$E$2:$F$161,2,FALSE), IFERROR(VLOOKUP($B$6,医学部団体!$E$2:$F$47,2,FALSE), 0)), \"\")","v":""},null,null,"",53]
["",{"$f":"IF(C66<>\"\", IFERROR(VLOOKUP($B$6,全学団体!$E$2:$F$161,2,FALSE), IFERROR(VLOOKUP($B$6,医学部団体!$E$2:$F$47,2,FALSE), 0)), \"\")","v":""},null,null,"",54]
["",{"$f":"IF(C67<>\"\", IFERROR(VLOOKUP($B$6,全学団体!$E$2:$F$161,2,FALSE), IFERROR(VLOOKUP($B$6,医学部団体!$E$2:$F$47,2,FALSE), 0)), \"\")","v":""},null,null,"",55]
["",{"$f":"IF(C68<>\"\", IFERROR(VLOOKUP($B$6,全学団体!$E$2:$F$161,2,FALSE), IFERROR(VLOOKUP($B$6,医学部団体!$E$2:$F$47,2,FALSE), 0)), \"\")","v":""},null,null,"",56]
["",{"$f":"IF(C69<>\"\", IFERROR(VLOOKUP($B$6,全学団体!$E$2:$F$161,2,FALSE), IFERROR(VLOOKUP($B$6,医学部団体!$E$2:$F$47,2,FALSE), 0)), \"\")","v":""},null,null,"",57]
["",{"$f":"IF(C70<>\"\", IFERROR(VLOOKUP($B$6,全学団体!$E$2:$F$161,2,FALSE), IFERROR(VLOOKUP($B$6,医学部団体!$E$2:$F$47,2,FALSE), 0)), \"\")","v":""},null,null,"",58]
["",{"$f":"IF(C71<>\"\", IFERROR(VLOOKUP($B$6,全学団体!$E$2:$F$161,2,FALSE), IFERROR(VLOOKUP($B$6,医学部団体!$E$2:$F$47,2,FALSE), 0)), \"\")","v":""},null,null,"",59]
["",{"$f":"IF(C72<>\"\", IFERROR(VLOOKUP($B$6,全学団体!$E$2:$F$161,2,FALSE), IFERROR(VLOOKUP($B$6,医学部団体!$E$2:$F$47,2,FALSE), 0)), \"\")","v":""},null,null,"",60]
["",{"$f":"IF(C73<>\"\", IFERROR(VLOOKUP($B$6,全学団体!$E$2:$F$161,2,FALSE), IFERROR(VLOOKUP($B$6,医学部団体!$E$2:$F$47,2,FALSE), 0)), \"\")","v":""},null,null,"",61]
["",{"$f":"IF(C74<>\"\", IFERROR(VLOOKUP($B$6,全学団体!$E$2:$F$161,2,FALSE), IFERROR(VLOOKUP($B$6,医学部団体!$E$2:$F$47,2,FALSE), 0)), \"\")","v":""},null,null,"",62]
["",{"$f":"IF(C75<>\"\", IFERROR(VLOOKUP($B$6,全学団体!$E$2:$F$161,2,FALSE), IFERROR(VLOOKUP($B$6,医学部団体!$E$2:$F$47,2,FALSE), 0)), \"\")","v":""},null,null,"",63]
["",{"$f":"IF(C76<>\"\", IFERROR(VLOOKUP($B$6,全学団体!$E$2:$F$161,2,FALSE), IFERROR(VLOOKUP($B$6,医学部団体!$E$2:$F$47,2,FALSE), 0)), \"\")","v":""},null,null,"",64]
["",{"$f":"IF(C77<>\"\", IFERROR(VLOOKUP($B$6,全学団体!$E$2:$F$161,2,FALSE), IFERROR(VLOOKUP($B$6,医学部団体!$E$2:$F$47,2,FALSE), 0)), \"\")","v":""},null,null,"",65]
["",{"$f":"IF(C78<>\"\", IFERROR(VLOOKUP($B$6,全学団体!$E$2:$F$161,2,FALSE), IFERROR(VLOOKUP($B$6,医学部団体!$E$2:$F$47,2,FALSE), 0)), \"\")","v":""},null,null,"",66]
["",{"$f":"IF(C79<>\"\", IFERROR(VLOOKUP($B$6,全学団体!$E$2:$F$161,2,FALSE), IFERROR(VLOOKUP($B$6,医学部団体!$E$2:$F$47,2,FALSE), 0)), \"\")","v":""},null,null,{"$f":"IF(C79<>\"\", 2026, \"\")","v":""},67]
["",{"$f":"IF(C80<>\"\", IFERROR(VLOOKUP($B$6,全学団体!$E$2:$F$161,2,FALSE), IFERROR(VLOOKUP($B$6,医学部団体!$E$2:$F$47,2,FALSE), 0)), \"\")","v":""},null,null,"",68]
{"$rows_left_out":183}
{"sheet":"システム取込用","index":1,"n_rows":1,"n_cols":1,"rows_kept":1,"cut":false,"hidden":false,"merged":[]}
[{"$f":"_xlfn._xlws.FILTER(名簿!A13:E10000, (名簿!A13:A10000<>\"\")+(名簿!B13:B10000<>\"\")+(名簿!C13:C10000<>\"\")+(名簿!D13:D10000<>\"\")+(名簿!E13:E10000<>\"\"), \"\")","v":""}]

{"sheet":"全学団体","index":2,"n_rows":161,"n_cols":9,"rows_kept":161,"cut":false,"hidden":true,"merged":[]}
["所属","全学・医学","学友会","区分","団体名称","サークルマスタ"]
["松本キャンパス","全学","◯","文化系","信州大学交響楽団","10100101","松本キャンパス"]
["松本キャンパス","全学","◯","文化系","信州大学吹奏楽団","10100102","学友会所属団体","学友会に所属していない団体"]
["松本キャンパス","全学","◯","文化系","マンドリンクラブ","10100103","体育系","文化系"]
["松本キャンパス","全学","◯","文化系","信州大学混声合唱団　　","10100104","体育系","文化系","その他"]
["松本キャンパス","全学","◯","文化系","信州大学軽音楽部","10100105"]
["松本キャンパス","全学","◯","文化系","信州大学グリークラブ","10100106"]
["松本キャンパス","全学","◯","文化系","棋道部","10100107"]
["松本キャンパス","全学","◯","文化系","信州大学競技かるたサークル","10100109"]
["松本キャンパス","全学","◯","文化系","フラメンコ部","10100110"]
["松本キャンパス","全学","◯","文化系","筝曲サークルことこと","10100111"]
["松本キャンパス","全学","◯","文化系","医学部室内楽団","10100112"]
["松本キャンパス","全学","◯","体育系","陸上競技部　","10100201"]
["松本キャンパス","全学","◯","体育系","全学水泳部","10100202"]
["松本キャンパス","全学","◯","体育系","硬式野球部","10100203"]
["松本キャンパス","全学","◯","体育系","全学硬式庭球部","10100204"]
["松本キャンパス","全学","◯","体育系","全学ソフトテニス部","10100205"]
["松本キャンパス","全学","◯","体育系","信州大学全学卓球部","10100206"]
["松本キャンパス","全学","◯","体育系","全学サッカー部","10100207"]
["松本キャンパス","全学","◯","体育系","全学ラグビー部","10100208"]
["松本キャンパス","全学","◯","体育系","柔道部","10100209"]
["松本キャンパス","全学","◯","体育系","信州大学学友会剣道部","10100210"]
["松本キャンパス","全学","◯","体育系","全学弓道部","10100211"]
["松本キャンパス","全学","◯","体育系","体操競技部","10100212"]
["松本キャンパス","全学","◯","体育系","競技スキー部","10100213"]
["松本キャンパス","全学","◯","体育系","全学ハンドボール部","10100214"]
["松本キャンパス","全学","◯","体育系","全学男子バスケットボール部","10100215"]
["松本キャンパス","全学","◯","体育系","女子バスケットボール部","10100216"]
["松本キャンパス","全学","◯","体育系","氷上競技部スピードスケート部門","10100217"]
["松本キャンパス","全学","◯","体育系","全学男子バレーボール部","10100218"]
["松本キャンパス","全学","◯","体育系","女子バレーボール部","10100219"]
["松本キャンパス","全学","◯","体育系","全学バドミントン部","10100220"]
["松本キャンパス","全学","◯","体育系","少林寺拳法部","10100221"]
["松本キャンパス","全学","◯","体育系","全学空手道部","10100222"]
["松本キャンパス","全学","◯","体育系","信州大学アメリカンフットボール部WILDCATS","10100223"]
["松本キャンパス","全学","◯","体育系","合気道部","10100224"]
["松本キャンパス","全学","◯","体育系","全学男女ソフトボール部","10100225"]
["松本キャンパス","全学","◯","体育系","アーチェリー部","10100226"]
["松本キャンパス","全学","◯","体育系","自転車競技部","10100227"]
["松本キャンパス","全学","◯","体育系","準硬式野球部","10100228"]
["松本キャンパス","全学","◯","体育系","全学女子サッカー部","10100229"]
["松本キャンパス","全学","◯","体育系","信州大学YOSAKOI祭りサークル和っしょい","10100230"]
["松本キャンパス","全学","◯","体育系","信州大学フェンシング部","10100231"]
["松本キャンパス","全学","◯","体育系","信州大学松本軟式野球部","10100232"]
["松本キャンパス","全学","◯","体育系","LOOSE","10100234"]
["松本キャンパス","全学","◯","体育系","信州大学女子ラクロス部","10100235"]
["松本キャンパス","全学","◯","体育系","男子ラクロス部","10100237"]
["松本キャンパス","全学","◯","体育系","車いすバスケットボール部SEROWS","10100238"]
["松本キャンパス","全学","◯","体育系","信州大学フットサル部vaizravaNa",10100239]
["松本キャンパス","全学","◯","体育系","氷上競技部アイスホッケー部門","20100205"]
["松本キャンパス","全学","◯","体育系","馬術部","20100219"]
["松本キャンパス","全学",null,"文化系","かしの木",20100101]
["松本キャンパス","全学",null,"文化系","美術研究会",20100102]
["松本キャンパス","全学",null,"文化系","文藝部楓",20100104]
["松本キャンパス","全学",null,"文化系","信州大学自然科学研究会",20100105]
["松本キャンパス","全学",null,"文化系","信州大学トゥルバドゥール",20100107]
["松本キャンパス","全学",null,"文化系","信州大学裏千家茶道部",20100108]
["松本キャンパス","全学",null,"文化系","信州大学アカペラサークルCapel",20100109]
["松本キャンパス","全学",null,"文化系","信州大学らんぷの会",20100111]
["松本キャンパス","全学",null,"文化系","信州大学The Beatles研Q会",20100114]
["松本キャンパス","全学",null,"文化系","信州大学ALL写真部",20100116]
["松本キャンパス","全学",null,"文化系","信州大学　天文俱楽部",20100118]
["松本キャンパス","全学",null,"文化系","信州大学漫画研究会",20100119]
["松本キャンパス","全学",null,"文化系","信州大学劇団山脈",20100120]
["松本キャンパス","全学",null,"文化系","信州大学JAZZ研究会",20100121]
["松本キャンパス","全学",null,"文化系","第二新聞部NOA",20100125]
["松本キャンパス","全学",null,"文化系","Simulation Game研究会",20100127]
["松本キャンパス","全学",null,"文化系","TOSS信州大学",20100128]
["松本キャンパス","全学",null,"文化系","2代目ヒッチハイクサークルのりこみ隊",20100133]
["松本キャンパス","全学",null,"文化系","信州大学ジャグリングサークルサイクロイド",20100138]
["松本キャンパス","全学",null,"文化系","信州大学ケルト音楽研究会 S-celts",20100142]
["松本キャンパス","全学",null,"文化系","書道サークル　墨人",20100145]
["松本キャンパス","全学",null,"文化系","昔ながらの田んぼの会",20100149]
["松本キャンパス","全学",null,"文化系","信州大学レトロ音楽俱楽部",20100150]
["松本キャンパス","全学",null,"文化系","信州大学のりものサークル",20100159]
["松本キャンパス","全学",null,"文化系","信州大学クイズサークル",20100160]
["松本キャンパス","全学",null,"文化系","信大回廊",20100168]
["松本キャンパス","全学",null,"文化系","信州大学ポケモンサークル",20100169]
["松本キャンパス","全学",null,"文化系","現代限界芸術研究会",20100178]
["松本キャンパス","全学",null,"文化系","現代文化研究会Shin@no",20100182]
{"$rows_left_out":82}
{"sheet":"医学部団体","index":3,"n_rows":47,"n_cols":8,"rows_kept":47,"cut":false,"hidden":true,"merged":[]}
["所属","全学・医学","学友会","区分","団体名称","サークルマスタ"]
["松本キャンパス","医学部",null,"文化系","医学部軽音楽部","20110101","松本キャンパス"]
["松本キャンパス","医学部",null,"文化系","医学部写真部","20110102","医学部団体"]
["松本キャンパス","医学部",null,"文化系","医学部天文部","20110103","学友会所属団体","学友会に所属していない団体"]
["松本キャンパス","医学部",null,"文化系","メディカル映画研究会","20110104","体育系","文化系"]
["松本キャンパス","医学部",null,"文化系","Medical English Speaking Society","20110105"]
["松本キャンパス","医学部",null,"文化系","Shinshu Advanced Life-support Teams","20110106"]
["松本キャンパス","医学部",null,"文化系","医学部交響楽団","20110107"]
["松本キャンパス","医学部",null,"文化系","わらわら","20110108"]
["松本キャンパス","医学部",null,"文化系","医学部信州大好きクラブ","20110109"]
["松本キャンパス","医学部",null,"文化系","医学部ダンス部","20110110"]
["松本キャンパス","医学部",null,"文化系","MEDICAL HEALTH","20110111"]
["松本キャンパス","医学部",null,"文化系","医学部茶道部","20110113"]
["松本キャンパス","医学部",null,"文化系","MHC","20110115"]
["松本キャンパス","医学部",null,"文化系","医学部映画研究会",20110116]
["松本キャンパス","医学部",null,"文化系","SinUS",20110117]
["松本キャンパス","医学部",null,"文化系","医学を真剣に楽しみ、深める会",20110119]
["松本キャンパス","医学部",null,"文化系","信州大学東洋医学勉強会",20110119]
["松本キャンパス","医学部",null,"文化系","ぬいぬい部",20110120]
["松本キャンパス","医学部",null,"体育系","信州大学医学部硬式庭球部","20110201"]
["松本キャンパス","医学部",null,"体育系","医学部軟式テニス部","20110202"]
["松本キャンパス","医学部",null,"体育系","医学部男子バレーボール部","20110203"]
["松本キャンパス","医学部",null,"体育系","医学部女子バレーボール部","20110204"]
["松本キャンパス","医学部",null,"体育系","医学部男子バスケットボール部","20110205"]
["松本キャンパス","医学部",null,"体育系","医学部女子バスケットボール部","20110206"]
["松本キャンパス","医学部",null,"体育系","医学部ラグビー部","20110207"]
["松本キャンパス","医学部",null,"体育系","医学部サッカー部","20110208"]
["松本キャンパス","医学部",null,"体育系","医学部硬式野球部","20110209"]
["松本キャンパス","医学部",null,"体育系","医学部ゴルフ部","20110210"]
["松本キャンパス","医学部",null,"体育系","医学部卓球部","20110211"]
["松本キャンパス","医学部",null,"体育系","医学部医短バドミントン部","20110212"]
["松本キャンパス","医学部",null,"体育系","医学部水泳部","20110213"]
["松本キャンパス","医学部",null,"体育系","医学部陸上競技部","20110214"]
["松本キャンパス","医学部",null,"体育系","医学部競技スキー部","20110215"]
["松本キャンパス","医学部",null,"体育系","信州大学医学部馬術部","20110216"]
["松本キャンパス","医学部",null,"体育系","信州大学医学部山岳部","20110217"]
["松本キャンパス","医学部",null,"体育系","医学部弓道部","20110218"]
["松本キャンパス","医学部",null,"体育系","信州大学医学部剣道部","20110219"]
["松本キャンパス","医学部",null,"体育系","医学部空手道部","20110220"]
["松本キャンパス","医学部",null,"体育系","医学部柔道部","20110221"]
["松本キャンパス","医学部",null,"体育系","医学部フットサル部","20110222"]
["松本キャンパス","医学部",null,"体育系","医学部女子卓球部","20110223"]
["松本キャンパス","医学部",null,"体育系","医学部男子ハンドボール部","20110224"]
["松本キャンパス","医学部",null,"体育系","医学部バーベル部","20110225"]
["松本キャンパス","医学部",null,"体育系","医学部ラージボール卓球部","20110226"]
["松本キャンパス","医学部",null,"体育系","医学部女子ハンドボール部","20110227"]
["松本キャンパス","医学部","◯","文化系","医学部室内楽団",10100112]