{"text_format":"1","workbook":"xlsx","n_sheets":4,"sheets":["名簿","システム取込用","全学団体","医学部団体"],"not_rendered":{"charts":0,"images":0,"macros":1,"external_links":0,"defined_names":19,"comments":0,"pivot_tables":0},"unopened":[],"bounds":{"document_bytes":16777216,"sheet_cells":100000,"rows_first":2000,"rows_last":500,"rows_between":2000,"halvings":0,"cell_chars":16384,"cell_head_chars":4096},"cells_cut":0,"cells_raw":0,"read":"whole","date_system":"1900"}

{"sheet":"名簿","index":0,"n_rows":262,"n_cols":6,"rows_kept":262,"cut":false,"hidden":false,"merged":[[5,1,5,3],[4,1,4,3],[3,1,3,3],[1,1,1,3],[8,1,8,3],[2,1,2,3]]}
["継続団体"]
["所属","松本キャンパス"]
["全学・医学"]
["学友会の所属"]
["活動区分"]
["団体名"]
[]
["新規団体"]
["団体名"]
[]
["所属学生名簿"]
["コード(自動入力)","学籍番号","氏名","整理番号","半角英数修正","半角・大文字修正"]
[{"$f":"IFERROR(VLOOKUP($B$6,全学団体!$E$2:$F$139,2,FALSE),VLOOKUP($B$6,医学部団体!$E$2:$F$40,2,FALSE))","v":{"$error":"#N/A"}},null,null,1,{"$f":"ASC(B13)","v":""},{"$f":"UPPER(E13)","v":""}]
[{"$f":"IFERROR(VLOOKUP($B$6,全学団体!$E$2:$F$139,2,FALSE),VLOOKUP($B$6,医学部団体!$E$2:$F$40,2,FALSE))","v":{"$error":"#N/A"}},null,null,2,{"$f":"ASC(B14)","v":""},{"$f":"UPPER(E14)","v":""}]
[{"$f":"IFERROR(VLOOKUP($B$6,全学団体!$E$2:$F$139,2,FALSE),VLOOKUP($B$6,医学部団体!$E$2:$F$40,2,FALSE))","v":{"$error":"#N/A"}},null,null,3,"",""]
[{"$f":"IFERROR(VLOOKUP($B$6,全学団体!$E$2:$F$139,2,FALSE),VLOOKUP($B$6,医学部団体!$E$2:$F$40,2,FALSE))","v":{"$error":"#N/A"}},null,null,4,"",""]
[{"$f":"IFERROR(VLOOKUP($B$6,全学団体!$E$2:$F$139,2,FALSE),VLOOKUP($B$6,医学部団体!$E$2:$F$40,2,FALSE))","v":{"$error":"#N/A"}},null,null,5,"",""]
[{"$f":"IFERROR(VLOOKUP($B$6,全学団体!$E$2:$F$139,2,FALSE),VLOOKUP($B$6,医学部団体!$E$2:$F$40,2,FALSE))","v":{"$error":"#N/A"}},null,null,6,"",""]
[{"$f":"IFERROR(VLOOKUP($B$6,全学団体!$E$2:$F$139,2,FALSE),VLOOKUP($B$6,医学部団体!$E$2:$F$40,2,FALSE))","v":{"$error":"#N/A"}},null,null,7,"",""]
[{"$f":"IFERROR(VLOOKUP($B$6,全学団体!$E$2:$F$139,2,FALSE),VLOOKUP($B$6,医学部団体!$E$2:$F$40,2,FALSE))","v":{"$error":"#N/A"}},null,null,8,"",""]
[{"$f":"IFERROR(VLOOKUP($B$6,全学団体!$E$2:$F$139,2,FALSE),VLOOKUP($B$6,医学部団体!$E$2:$F$40,2,FALSE))","v":{"$error":"#N/A"}},null,null,9,"",""]
[{"$f":"IFERROR(VLOOKUP($B$6,全学団体!$E$2:$F$139,2,FALSE),VLOOKUP($B$6,医学部団体!$E$2:$F$40,2,FALSE))","v":{"$error":"#N/A"}},null,null,10,"",""]
[{"$f":"IFERROR(VLOOKUP($B$6,全学団体!$E$2:$F$139,2,FALSE),VLOOKUP($B$6,医学部団体!$E$2:$F$40,2,FALSE))","v":{"$error":"#N/A"}},null,null,11,"",""]
[{"$f":"IFERROR(VLOOKUP($B$6,全学団体!$E$2:$F$139,2,FALSE),VLOOKUP($B$6,医学部団体!$E$2:$F$40,2,FALSE))","v":{"$error":"#N/A"}},null,null,12,"",""]
[{"$f":"IFERROR(VLOOKUP($B$6,全学団体!$E$2:$F$139,2,FALSE),VLOOKUP($B$6,医学部団体!$E$2:$F$40,2,FALSE))","v":{"$error":"#N/A"}},null,null,13,"",""]
[{"$f":"IFERROR(VLOOKUP($B$6,全学団体!$E$2:$F$139,2,FALSE),VLOOKUP($B$6,医学部団体!$E$2:$F$40,2,FALSE))","v":{"$error":"#N/A"}},null,null,14,"",""]
[{"$f":"IFERROR(VLOOKUP($B$6,全学団体!$E$2:$F$139,2,FALSE),VLOOKUP($B$6,医学部団体!$E$2:$F$40,2,FALSE))","v":{"$error":"#N/A"}},null,null,15,"",""]
[{"$f":"IFERROR(VLOOKUP($B$6,全学団体!$E$2:$F$139,2,FALSE),VLOOKUP($B$6,医学部団体!$E$2:$F$40,2,FALSE))","v":{"$error":"#N/A"}},null,null,16,"",""]
[{"$f":"IFERROR(VLOOKUP($B$6,全学団体!$E$2:$F$139,2,FALSE),VLOOKUP($B$6,医学部団体!$E$2:$F$40,2,FALSE))","v":{"$error":"#N/A"}},null,null,17,"",""]
[{"$f":"IFERROR(VLOOKUP($B$6,全学団体!$E$2:$F$139,2,FALSE),VLOOKUP($B$6,医学部団体!$E$2:$F$40,2,FALSE))","v":{"$error":"#N/A"}},null,null,18,"",""]
[{"$f":"IFERROR(VLOOKUP($B$6,全学団体!$E$2:$F$139,2,FALSE),VLOOKUP($B$6,医学部団体!$E$2:$F$40,2,FALSE))","v":{"$error":"#N/A"}},null,null,19,"",""]
[{"$f":"IFERROR(VLOOKUP($B$6,全学団体!$E$2:$F$139,2,FALSE),VLOOKUP($B$6,医学部団体!$E$2:$F$40,2,FALSE))","v":{"$error":"#N/A"}},null,null,20,"",""]
[{"$f":"IFERROR(VLOOKUP($B$6,全学団体!$E$2:$F$139,2,FALSE),VLOOKUP($B$6,医学部団体!$E$2:$F$40,2,FALSE))","v":{"$error":"#N/A"}},null,null,21,"",""]
[{"$f":"IFERROR(VLOOKUP($B$6,全学団体!$E$2:$F$139,2,FALSE),VLOOKUP($B$6,医学部団体!$E$2:$F$40,2,FALSE))","v":{"$error":"#N/A"}},null,null,22,"",""]
[{"$f":"IFERROR(VLOOKUP($B$6,全学団体!$E$2:$F$139,2,FALSE),VLOOKUP($B$6,医学部団体!$E$2:$F$40,2,FALSE))","v":{"$error":"#N/A"}},null,null,23,"",""]
[{"$f":"IFERROR(VLOOKUP($B$6,全学団体!$E$2:$F$139,2,FALSE),VLOOKUP($B$6,医学部団体!$E$2:$F$40,2,FALSE))","v":{"$error":"#N/A"}},null,null,24,"",""]
[{"$f":"IFERROR(VLOOKUP($B$6,全学団体!$E$2:$F$139,2,FALSE),VLOOKUP($B$6,医学部団体!$E$2:$F$40,2,FALSE))","v":{"$error":"#N/A"}},null,null,25,"",""]
[{"$f":"IFERROR(VLOOKUP($B$6,全学団体!$E$2:$F$139,2,FALSE),VLOOKUP($B$6,医学部団体!$E$2:$F$40,2,FALSE))","v":{"$error":"#N/A"}},null,null,26,"",""]
[{"$f":"IFERROR(VLOOKUP($B$6,全学団体!$E$2:$F$139,2,FALSE),VLOOKUP($B$6,医学部団体!$E$2:$F$40,2,FALSE))","v":{"$error":"#N/A"}},null,null,27,"",""]
[{"$f":"IFERROR(VLOOKUP($B$6,全学団体!$E$2:$F$139,2,FALSE),VLOOKUP($B$6,医学部団体!$E$2:$F$40,2,FALSE))","v":{"$error":"#N/A"}},null,null,28,"",""]
[{"$f":"IFERROR(VLOOKUP($B$6,全学団体!$E$2:$F$139,2,FALSE),VLOOKUP($B$6,医学部団体!$E$2:$F$40,2,FALSE))","v":{"$error":"#N/A"}},null,null,29,"",""]
[{"$f":"IFERROR(VLOOKUP($B$6,全学団体!$E$2:$F$139,2,FALSE),VLOOKUP($B$6,医学部団体!$E$2:$F$40,2,FALSE))","v":{"$error":"#N/A"}},null,null,30,"",""]
[{"$f":"IFERROR(VLOOKUP($B$6,全学団体!$E$2:$F$139,2,FALSE),VLOOKUP($B$6,医学部団体!$E$2:$F$40,2,FALSE))","v":{"$error":"#N/A"}},null,null,31,"",""]
[{"$f":"IFERROR(VLOOKUP($B$6,全学団体!$E$2:$F$139,2,FALSE),VLOOKUP($B$6,医学部団体!$E$2:$F$40,2,FALSE))","v":{"$error":"#N/A"}},null,null,32,"",""]
[{"$f":"IFERROR(VLOOKUP($B$6,全学団体!$E$2:$F$139,2,FALSE),VLOOKUP($B$6,医学部団体!$E$2:$F$40,2,FALSE))","v":{"$error":"#N/A"}},null,null,33,"",""]
[{"$f":"IFERROR(VLOOKUP($B$6,全学団体!$E$2:$F$139,2,FALSE),VLOOKUP($B$6,医学部団体!$E$2:$F$40,2,FALSE))","v":{"$error":"#N/A"}},null,null,34,"",""]
[{"$f":"IFERROR(VLOOKUP($B$6,全学団体!$E$2:$F$139,2,FALSE),VLOOKUP($B$6,医学部団体!$E$2:$F$40,2,FALSE))","v":{"$error":"#N/A"}},null,null,35,"",""]
[{"$f":"IFERROR(VLOOKUP($B$6,全学団体!$E$2:$F$139,2,FALSE),VLOOKUP($B$6,医学部団体!$E$2:$F$40,2,FALSE))","v":{"$error":"#N/A"}},null,null,36,"",""]
[{"$f":"IFERROR(VLOOKUP($B$6,全学団体!$E$2:$F$139,2,FALSE),VLOOKUP($B$6,医学部団体!$E$2:$F$40,2,FALSE))","v":{"$error":"#N/A"}},null,null,37,"",""]
[{"$f":"IFERROR(VLOOKUP($B$6,全学団体!$E$2:$F$139,2,FALSE),VLOOKUP($B$6,医学部団体!$E$2:$F$40,2,FALSE))","v":{"$error":"#N/A"}},null,null,38,"",""]
[{"$f":"IFERROR(VLOOKUP($B$6,全学団体!$E$2:$F$139,2,FALSE),VLOOKUP($B$6,医学部団体!$E$2:$F$40,2,FALSE))","v":{"$error":"#N/A"}},null,null,39,"",""]
[{"$f":"IFERROR(VLOOKUP($B$6,全学団体!$E$2:$F$139,2,FALSE),VLOOKUP($B$6,医学部団体!$E$2:$F$40,2,FALSE))","v":{"$error":"#N/A"}},null,null,40,"",""]
[{"$f":"IFERROR(VLOOKUP($B$6,全学団体!$E$2:$F$139,2,FALSE),VLOOKUP($B$6,医学部団体!$E$2:$F$40,2,FALSE))","v":{"$error":"#N/A"}},null,null,41,"",""]
[{"$f":"IFERROR(VLOOKUP($B$6,全学団体!$E$2:$F$139,2,FALSE),VLOOKUP($B$6,医学部団体!$E$2:$F$40,2,FALSE))","v":{"$error":"#N/A"}},null,null,42,"",""]
[{"$f":"IFERROR(VLOOKUP($B$6,全学団体!$E$2:$F$139,2,FALSE),VLOOKUP($B$6,医学部団体!$E$2:$F$40,2,FALSE))","v":{"$error":"#N/A"}},null,null,43,"",""]
[{"$f":"IFERROR(VLOOKUP($B$6,全学団体!$E$2:$F$139,2,FALSE),VLOOKUP($B$6,医学部団体!$E$2:$F$40,2,FALSE))","v":{"$error":"#N/A"}},null,null,44,"",""]
[{"$f":"IFERROR(VLOOKUP($B$6,全学団体!$E$2:$F$139,2,FALSE),VLOOKUP($B$6,医学部団体!$E$2:$F$40,2,FALSE))","v":{"$error":"#N/A"}},null,null,45,"",""]
[{"$f":"IFERROR(VLOOKUP($B$6,全学団体!$E$2:$F$139,2,FALSE),VLOOKUP($B$6,医学部団体!$E$2:$F$40,2,FALSE))","v":{"$error":"#N/A"}},null,null,46,"",""]
[{"$f":"IFERROR(VLOOKUP($B$6,全学団体!$E$2:$F$139,2,FALSE),VLOOKUP($B$6,医学部団体!$E$2:$F$40,2,FALSE))","v":{"$error":"#N/A"}},null,null,47,"",""]
[{"$f":"IFERROR(VLOOKUP($B$6,全学団体!$E$2:$F$139,2,FALSE),VLOOKUP($B$6,医学部団体!$E$2:$F$40,2,FALSE))","v":{"$error":"#N/A"}},null,null,48,"",""]
[{"$f":"IFERROR(VLOOKUP($B$6,全学団体!$E$2:$F$139,2,FALSE),VLOOKUP($B$6,医学部団体!$E$2:$F$40,2,FALSE))","v":{"$error":"#N/A"}},null,null,49,"",""]
[{"$f":"IFERROR(VLOOKUP($B$6,全学団体!$E$2:$F$139,2,FALSE),VLOOKUP($B$6,医学部団体!$E$2:$F$40,2,FALSE))","v":{"$error":"#N/A"}},null,null,50,"",""]
[{"$f":"IFERROR(VLOOKUP($B$6,全学団体!$E$2:$F$139,2,FALSE),VLOOKUP($B$6,医学部団体!$E$2:$F$40,2,FALSE))","v":{"$error":"#N/A"}},null,null,51,"",""]
[{"$f":"IFERROR(VLOOKUP($B$6,全学団体!$E$2:$F$139,2,FALSE),VLOOKUP($B$6,医学部団体!$E$2:$F$40,2,FALSE))","v":{"$error":"#N/A"}},null,null,52,"",""]
[{"$f":"IFERROR(VLOOKUP($B$6,全学団体!$E$2:$F$139,2,FALSE),VLOOKUP($B$6,医学部団体!$E$2:$F$40,2,FALSE))","v":{"$error":"#N/A"}},null,null,53,"",""]
[{"$f":"IFERROR(VLOOKUP($B$6,全学団体!$E$2:$F$139,2,FALSE),VLOOKUP($B$6,医学部団体!$E$2:$F$40,2,FALSE))","v":{"$error":"#N/A"}},null,null,54,"",""]
[{"$f":"IFERROR(VLOOKUP($B$6,全学団体!$E$2:$F$139,2,FALSE),VLOOKUP($B$6,医学部団体!$E$2:$F$40,2,FALSE))","v":{"$error":"#N/A"}},null,null,55,"",""]
[{"$f":"IFERROR(VLOOKUP($B$6,全学団体!$E$2:$F$139,2,FALSE),VLOOKUP($B$6,医学部団体!$E$2:$F$40,2,FALSE))","v":{"$error":"#N/A"}},null,null,56,"",""]
[{"$f":"IFERROR(VLOOKUP($B$6,全学団体!$E$2:$F$139,2,FALSE),VLOOKUP($B$6,医学部団体!$E$2:$F$40,2,FALSE))","v":{"$error":"#N/A"}},null,null,57,"",""]
[{"$f":"IFERROR(VLOOKUP($B$6,全学団体!$E$2:$F$139,2,FALSE),VLOOKUP($B$6,医学部団体!$E$2:$F$40,2,FALSE))","v":{"$error":"#N/A"}},null,null,58,"",""]
[{"$f":"IFERROR(VLOOKUP($B$6,全学団体!$E$2:$F$139,2,FALSE),VLOOKUP($B$6,医学部団体!$E$2:$F$40,2,FALSE))","v":{"$error":"#N/A"}},null,null,59,"",""]
[{"$f":"IFERROR(VLOOKUP($B$6,全学団体!$E$2:$F$139,2,FALSE),VLOOKUP($B$6,医学部団体!$E$2:$F$40,2,FALSE))","v":{"$error":"#N/A"}},null,null,60,"",""]
[{"$f":"IFERROR(VLOOKUP($B$6,全学団体!$E$2:$F$139,2,FALSE),VLOOKUP($B$6,医学部団体!$E$2:$F$40,2,FALSE))","v":{"$error":"#N/A"}},null,null,61,"",""]
[{"$f":"IFERROR(VLOOKUP($B$6,全学団体!$E$2:$F$139,2,FALSE),VLOOKUP($B$6,医学部団体!$E$2:$F$40,2,FALSE))","v":{"$error":"#N/A"}},null,null,62,"",""]
[{"$f":"IFERROR(VLOOKUP($B$6,全学団体!$E$2:$F$139,2,FALSE),VLOOKUP($B$6,医学部団体!$E$2:$F$40,2,FALSE))","v":{"$error":"#N/A"}},null,null,63,"",""]
[{"$f":"IFERROR(VLOOKUP($B$6,全学団体!$E$2:$F$139,2,FALSE),VLOOKUP($B$6,医学部団体!$E$2:$F$40,2,FALSE))","v":{"$error":"#N/A"}},null,null,64,"",""]
[{"$f":"IFERROR(VLOOKUP($B$6,全学団体!$E$2:$F$139,2,FALSE),VLOOKUP($B$6,医学部団体!$E$2:$F$40,2,FALSE))","v":{"$error":"#N/A"}},null,null,65,"",""]
[{"$f":"IFERROR(VLOOKUP($B$6,全学団体!$E$2:$F$139,2,FALSE),VLOOKUP($B$6,医学部団体!$E$2:$F$40,2,FALSE))","v":{"$error":"#N/A"}},null,null,66,{"$f":"ASC(B78)","v":""},{"$f":"UPPER(E78)","v":""}]
[{"$f":"IFERROR(VLOOKUP($B$6,全学団体!$E$2:$F$139,2,FALSE),VLOOKUP($B$6,医学部団体!$E$2:$F$40,2,FALSE))","v":{"$error":"#N/A"}},null,null,67,"",""]
[{"$f":"IFERROR(VLOOKUP($B$6,全学団体!$E$2:$F$139,2,FALSE),VLOOKUP($B$6,医学部団体!$E$2:$F$40,2,FALSE))","v":{"$error":"#N/A"}},null,null,68,"",""]
{"$rows_left_out":183}
{"sheet":"システム取込用","index":1,"n_rows":250,"n_cols":4,"rows_kept":250,"cut":false,"hidden":false,"merged":[]}
[{"$f":"名簿!$B$6","v":0},{"$f":"名簿!$A$13","v":{"$error":"#N/A"}},{"$f":"名簿!F13","v":""},{"$f":"名簿!C13","v":0}]
[{"$f":"名簿!$B$6","v":0},{"$f":"名簿!$A$13","v":{"$error":"#N/A"}},{"$f":"名簿!F14","v":""},{"$f":"名簿!C14","v":0}]
[{"$f":"名簿!$B$6","v":0},{"$f":"名簿!$A$13","v":{"$error":"#N/A"}},{"$f":"名簿!F15","v":""},{"$f":"名簿!C15","v":0}]
[{"$f":"名簿!$B$6","v":0},{"$f":"名簿!$A$13","v":{"$error":"#N/A"}},{"$f":"名簿!F16","v":""},{"$f":"名簿!C16","v":0}]
[{"$f":"名簿!$B$6","v":0},{"$f":"名簿!$A$13","v":{"$error":"#N/A"}},{"$f":"名簿!F17","v":""},{"$f":"名簿!C17","v":0}]
[{"$f":"名簿!$B$6","v":0},{"$f":"名簿!$A$13","v":{"$error":"#N/A"}},{"$f":"名簿!F18","v":""},{"$f":"名簿!C18","v":0}]
[{"$f":"名簿!$B$6","v":0},{"$f":"名簿!$A$13","v":{"$error":"#N/A"}},{"$f":"名簿!F19","v":""},{"$f":"名簿!C19","v":0}]
[{"$f":"名簿!$B$6","v":0},{"$f":"名簿!$A$13","v":{"$error":"#N/A"}},{"$f":"名簿!F20","v":""},{"$f":"名簿!C20","v":0}]
[{"$f":"名簿!$B$6","v":0},{"$f":"名簿!$A$13","v":{"$error":"#N/A"}},{"$f":"名簿!F21","v":""},{"$f":"名簿!C21","v":0}]
[{"$f":"名簿!$B$6","v":0},{"$f":"名簿!$A$13","v":{"$error":"#N/A"}},{"$f":"名簿!F22","v":""},{"$f":"名簿!C22","v":0}]
[{"$f":"名簿!$B$6","v":0},{"$f":"名簿!$A$13","v":{"$error":"#N/A"}},{"$f":"名簿!F23","v":""},{"$f":"名簿!C23","v":0}]
[{"$f":"名簿!$B$6","v":0},{"$f":"名簿!$A$13","v":{"$error":"#N/A"}},{"$f":"名簿!F24","v":""},{"$f":"名簿!C24","v":0}]
[{"$f":"名簿!$B$6","v":0},{"$f":"名簿!$A$13","v":{"$error":"#N/A"}},{"$f":"名簿!F25","v":""},{"$f":"名簿!C25","v":0}]
[{"$f":"名簿!$B$6","v":0},{"$f":"名簿!$A$13","v":{"$error":"#N/A"}},{"$f":"名簿!F26","v":""},{"$f":"名簿!C26","v":0}]
[{"$f":"名簿!$B$6","v":0},{"$f":"名簿!$A$13","v":{"$error":"#N/A"}},{"$f":"名簿!F27","v":""},{"$f":"名簿!C27","v":0}]
[{"$f":"名簿!$B$6","v":0},{"$f":"名簿!$A$13","v":{"$error":"#N/A"}},{"$f":"名簿!F28","v":""},{"$f":"名簿!C28","v":0}]
[{"$f":"名簿!$B$6","v":0},{"$f":"名簿!$A$13","v":{"$error":"#N/A"}},{"$f":"名簿!F29","v":""},{"$f":"名簿!C29","v":0}]
[{"$f":"名簿!$B$6","v":0},{"$f":"名簿!$A$13","v":{"$error":"#N/A"}},{"$f":"名簿!F30","v":""},{"$f":"名簿!C30","v":0}]
[{"$f":"名簿!$B$6","v":0},{"$f":"名簿!$A$13","v":{"$error":"#N/A"}},{"$f":"名簿!F31","v":""},{"$f":"名簿!C31","v":0}]
[{"$f":"名簿!$B$6","v":0},{"$f":"名簿!$A$13","v":{"$error":"#N/A"}},{"$f":"名簿!F32","v":""},{"$f":"名簿!C32","v":0}]
[{"$f":"名簿!$B$6","v":0},{"$f":"名簿!$A$13","v":{"$error":"#N/A"}},{"$f":"名簿!F33","v":""},{"$f":"名簿!C33","v":0}]
[{"$f":"名簿!$B$6","v":0},{"$f":"名簿!$A$13","v":{"$error":"#N/A"}},{"$f":"名簿!F34","v":""},{"$f":"名簿!C34","v":0}]
[{"$f":"名簿!$B$6","v":0},{"$f":"名簿!$A$13","v":{"$error":"#N/A"}},{"$f":"名簿!F35","v":""},{"$f":"名簿!C35","v":0}]
[{"$f":"名簿!$B$6","v":0},{"$f":"名簿!$A$13","v":{"$error":"#N/A"}},{"$f":"名簿!F36","v":""},{"$f":"名簿!C36","v":0}]
[{"$f":"名簿!$B$6","v":0},{"$f":"名簿!$A$13","v":{"$error":"#N/A"}},{"$f":"名簿!F37","v":""},{"$f":"名簿!C37","v":0}]
[{"$f":"名簿!$B$6","v":0},{"$f":"名簿!$A$13","v":{"$error":"#N/A"}},{"$f":"名簿!F38","v":""},{"$f":"名簿!C38","v":0}]
[{"$f":"名簿!$B$6","v":0},{"$f":"名簿!$A$13","v":{"$error":"#N/A"}},{"$f":"名簿!F39","v":""},{"$f":"名簿!C39","v":0}]
[{"$f":"名簿!$B$6","v":0},{"$f":"名簿!$A$13","v":{"$error":"#N/A"}},{"$f":"名簿!F40","v":""},{"$f":"名簿!C40","v":0}]
[{"$f":"名簿!$B$6","v":0},{"$f":"名簿!$A$13","v":{"$error":"#N/A"}},{"$f":"名簿!F41","v":""},{"$f":"名簿!C41","v":0}]
[{"$f":"名簿!$B$6","v":0},{"$f":"名簿!$A$13","v":{"$error":"#N/A"}},{"$f":"名簿!F42","v":""},{"$f":"名簿!C42","v":0}]
[{"$f":"名簿!$B$6","v":0},{"$f":"名簿!$A$13","v":{"$error":"#N/A"}},{"$f":"名簿!F43","v":""},{"$f":"名簿!C43","v":0}]
[{"$f":"名簿!$B$6","v":0},{"$f":"名簿!$A$13","v":{"$error":"#N/A"}},{"$f":"名簿!F44","v":""},{"$f":"名簿!C44","v":0}]
[{"$f":"名簿!$B$6","v":0},{"$f":"名簿!$A$13","v":{"$error":"#N/A"}},{"$f":"名簿!F45","v":""},{"$f":"名簿!C45","v":0}]
[{"$f":"名簿!$B$6","v":0},{"$f":"名簿!$A$13","v":{"$error":"#N/A"}},{"$f":"名簿!F46","v":""},{"$f":"名簿!C46","v":0}]
[{"$f":"名簿!$B$6","v":0},{"$f":"名簿!$A$13","v":{"$error":"#N/A"}},{"$f":"名簿!F47","v":""},{"$f":"名簿!C47","v":0}]
[{"$f":"名簿!$B$6","v":0},{"$f":"名簿!$A$13","v":{"$error":"#N/A"}},{"$f":"名簿!F48","v":""},{"$f":"名簿!C48","v":0}]
[{"$f":"名簿!$B$6","v":0},{"$f":"名簿!$A$13","v":{"$error":"#N/A"}},{"$f":"名簿!F49","v":""},{"$f":"名簿!C49","v":0}]
[{"$f":"名簿!$B$6","v":0},{"$f":"名簿!$A$13","v":{"$error":"#N/A"}},{"$f":"名簿!F50","v":""},{"$f":"名簿!C50","v":0}]
[{"$f":"名簿!$B$6","v":0},{"$f":"名簿!$A$13","v":{"$error":"#N/A"}},{"$f":"名簿!F51","v":""},{"$f":"名簿!C51","v":0}]
[{"$f":"名簿!$B$6","v":0},{"$f":"名簿!$A$13","v":{"$error":"#N/A"}},{"$f":"名簿!F52","v":""},{"$f":"名簿!C52","v":0}]
[{"$f":"名簿!$B$6","v":0},{"$f":"名簿!$A$13","v":{"$error":"#N/A"}},{"$f":"名簿!F53","v":""},{"$f":"名簿!C53","v":0}]
[{"$f":"名簿!$B$6","v":0},{"$f":"名簿!$A$13","v":{"$error":"#N/A"}},{"$f":"名簿!F54","v":""},{"$f":"名簿!C54","v":0}]
[{"$f":"名簿!$B$6","v":0},{"$f":"名簿!$A$13","v":{"$error":"#N/A"}},{"$f":"名簿!F55","v":""},{"$f":"名簿!C55","v":0}]
[{"$f":"名簿!$B$6","v":0},{"$f":"名簿!$A$13","v":{"$error":"#N/A"}},{"$f":"名簿!F56","v":""},{"$f":"名簿!C56","v":0}]
[{"$f":"名簿!$B$6","v":0},{"$f":"名簿!$A$13","v":{"$error":"#N/A"}},{"$f":"名簿!F57","v":""},{"$f":"名簿!C57","v":0}]
[{"$f":"名簿!$B$6","v":0},{"$f":"名簿!$A$13","v":{"$error":"#N/A"}},{"$f":"名簿!F58","v":""},{"$f":"名簿!C58","v":0}]
[{"$f":"名簿!$B$6","v":0},{"$f":"名簿!$A$13","v":{"$error":"#N/A"}},{"$f":"名簿!F59","v":""},{"$f":"名簿!C59","v":0}]
[{"$f":"名簿!$B$6","v":0},{"$f":"名簿!$A$13","v":{"$error":"#N/A"}},{"$f":"名簿!F60","v":""},{"$f":"名簿!C60","v":0}]
[{"$f":"名簿!$B$6","v":0},{"$f":"名簿!$A$13","v":{"$error":"#N/A"}},{"$f":"名簿!F61","v":""},{"$f":"名簿!C61","v":0}]
[{"$f":"名簿!$B$6","v":0},{"$f":"名簿!$A$13","v":{"$error":"#N/A"}},{"$f":"名簿!F62","v":""},{"$f":"名簿!C62","v":0}]
[{"$f":"名簿!$B$6","v":0},{"$f":"名簿!$A$13","v":{"$error":"#N/A"}},{"$f":"名簿!F63","v":""},{"$f":"名簿!C63","v":0}]
[{"$f":"名簿!$B$6","v":0},{"$f":"名簿!$A$13","v":{"$error":"#N/A"}},{"$f":"名簿!F64","v":""},{"$f":"名簿!C64","v":0}]
[{"$f":"名簿!$B$6","v":0},{"$f":"名簿!$A$13","v":{"$error":"#N/A"}},{"$f":"名簿!F65","v":""},{"$f":"名簿!C65","v":0}]
[{"$f":"名簿!$B$6","v":0},{"$f":"名簿!$A$13","v":{"$error":"#N/A"}},{"$f":"名簿!F66","v":""},{"$f":"名簿!C66","v":0}]
[{"$f":"名簿!$B$6","v":0},{"$f":"名簿!$A$13","v":{"$error":"#N/A"}},{"$f":"名簿!F67","v":""},{"$f":"名簿!C67","v":0}]
[{"$f":"名簿!$B$6","v":0},{"$f":"名簿!$A$13","v":{"$error":"#N/A"}},{"$f":"名簿!F68","v":""},{"$f":"名簿!C68","v":0}]
[{"$f":"名簿!$B$6","v":0},{"$f":"名簿!$A$13","v":{"$error":"#N/A"}},{"$f":"名簿!F69","v":""},{"$f":"名簿!C69","v":0}]
[{"$f":"名簿!$B$6","v":0},{"$f":"名簿!$A$13","v":{"$error":"#N/A"}},{"$f":"名簿!F70","v":""},{"$f":"名簿!C70","v":0}]
[{"$f":"名簿!$B$6","v":0},{"$f":"名簿!$A$13","v":{"$error":"#N/A"}},{"$f":"名簿!F71","v":""},{"$f":"名簿!C71","v":0}]
[{"$f":"名簿!$B$6","v":0},{"$f":"名簿!$A$13","v":{"$error":"#N/A"}},{"$f":"名簿!F72","v":""},{"$f":"名簿!C72","v":0}]
[{"$f":"名簿!$B$6","v":0},{"$f":"名簿!$A$13","v":{"$error":"#N/A"}},{"$f":"名簿!F73","v":""},{"$f":"名簿!C73","v":0}]
[{"$f":"名簿!$B$6","v":0},{"$f":"名簿!$A$13","v":{"$error":"#N/A"}},{"$f":"名簿!F74","v":""},{"$f":"名簿!C74","v":0}]
[{"$f":"名簿!$B$6","v":0},{"$f":"名簿!$A$13","v":{"$error":"#N/A"}},{"$f":"名簿!F75","v":""},{"$f":"名簿!C75","v":0}]
[{"$f":"名簿!$B$6","v":0},{"$f":"名簿!$A$13","v":{"$error":"#N/A"}},{"$f":"名簿!F76","v":""},{"$f":"名簿!C76","v":0}]
[{"$f":"名簿!$B$6","v":0},{"$f":"名簿!$A$13","v":{"$error":"#N/A"}},{"$f":"名簿!F77","v":""},{"$f":"名簿!C77","v":0}]
[{"$f":"名簿!$B$6","v":0},{"$f":"名簿!$A$13","v":{"$error":"#N/A"}},{"$f":"名簿!F78","v":""},{"$f":"名簿!C78","v":0}]
[{"$f":"名簿!$B$6","v":0},{"$f":"名簿!$A$13","v":{"$error":"#N/A"}},{"$f":"名簿!F79","v":""},{"$f":"名簿!C79","v":0}]
[{"$f":"名簿!$B$6","v":0},{"$f":"名簿!$A$13","v":{"$error":"#N/A"}},{"$f":"名簿!F80","v":""},{"$f":"名簿!C80","v":0}]
[{"$f":"名簿!$B$6","v":0},{"$f":"名簿!$A$13","v":{"$error":"#N/A"}},{"$f":"名簿!F81","v":""},{"$f":"名簿!C81","v":0}]
[{"$f":"名簿!$B$6","v":0},{"$f":"名簿!$A$13","v":{"$error":"#N/A"}},{"$f":"名簿!F82","v":""},{"$f":"名簿!C82","v":0}]
[{"$f":"名簿!$B$6","v":0},{"$f":"名簿!$A$13","v":{"$error":"#N/A"}},{"$f":"名簿!F83","v":""},{"$f":"名簿!C83","v":0}]
[{"$f":"名簿!$B$6","v":0},{"$f":"名簿!$A$13","v":{"$error":"#N/A"}},{"$f":"名簿!F84","v":""},{"$f":"名簿!C84","v":0}]
[{"$f":"名簿!$B$6","v":0},{"$f":"名簿!$A$13","v":{"$error":"#N/A"}},{"$f":"名簿!F85","v":""},{"$f":"名簿!C85","v":0}]
[{"$f":"名簿!$B$6","v":0},{"$f":"名簿!$A$13","v":{"$error":"#N/A"}},{"$f":"名簿!F86","v":""},{"$f":"名簿!C86","v":0}]
[{"$f":"名簿!$B$6","v":0},{"$f":"名簿!$A$13","v":{"$error":"#N/A"}},{"$f":"名簿!F87","v":""},{"$f":"名簿!C87","v":0}]
[{"$f":"名簿!$B$6","v":0},{"$f":"名簿!$A$13","v":{"$error":"#N/A"}},{"$f":"名簿!F88","v":""},{"$f":"名簿!C88","v":0}]
[{"$f":"名簿!$B$6","v":0},{"$f":"名簿!$A$13","v":{"$error":"#N/A"}},{"$f":"名簿!F89","v":""},{"$f":"名簿!C89","v":0}]
[{"$f":"名簿!$B$6","v":0},{"$f":"名簿!$A$13","v":{"$error":"#N/A"}},{"$f":"名簿!F90","v":""},{"$f":"名簿!C90","v":0}]
[{"$f":"名簿!$B$6","v":0},{"$f":"名簿!$A$13","v":{"$error":"#N/A"}},{"$f":"名簿!F91","v":""},{"$f":"名簿!C91","v":0}]
[{"$f":"名簿!$B$6","v":0},{"$f":"名簿!$A$13","v":{"$error":"#N/A"}},{"$f":"名簿!F92","v":""},{"$f":"名簿!C92","v":0}]
{"$rows_left_out":171}
{"sheet":"全学団体","index":2,"n_rows":150,"n_cols":9,"rows_kept":150,"cut":false,"hidden":true,"merged":[]}
["所属","全学・医学","学友会","区分","団体名称","サークルマスタ"]
["松本キャンパス","全学","◯","文化系","信州大学交響楽団","10100101","松本キャンパス"]
["松本キャンパス","全学","◯","文化系","信州大学吹奏楽団","10100102","学友会所属団体","学友会に所属していない団体"]
["松本キャンパス","全学","◯","文化系","マンドリンクラブ","10100103","体育系","文化系"]
["松本キャンパス","全学","◯","文化系","信州大学混声合唱団　　","10100104","体育系","文化系","その他"]
["松本キャンパス","全学","◯","文化系","信州大学軽音楽部","10100105"]
["松本キャンパス","全学","◯","文化系","信州大学グリークラブ","10100106"]
["松本キャンパス","全学","◯","文化系","棋道部","10100107"]
["松本キャンパス","全学","◯","文化系","信州大学競技かるたサークル","10100109"]
["松本キャンパス","全学","◯","文化系","フラメンコ部","10100110"]
["松本キャンパス","全学","◯","文化系","筝曲サークルことこと","10100111"]
["松本キャンパス","全学","◯","文化系","医学部室内楽団","10100112"]
["松本キャンパス","全学","◯","体育系","陸上競技部　","10100201"]
["松本キャンパス","全学","◯","体育系","全学水泳部","10100202"]
["松本キャンパス","全学","◯","体育系","硬式野球部","10100203"]
["松本キャンパス","全学","◯","体育系","全学硬式庭球部","10100204"]
["松本キャンパス","全学","◯","体育系","全学ソフトテニス部","10100205"]
["松本キャンパス","全学","◯","体育系","信州大学全学卓球部","10100206"]
["松本キャンパス","全学","◯","体育系","全学サッカー部","10100207"]
["松本キャンパス","全学","◯","体育系","全学ラグビー部","10100208"]
["松本キャンパス","全学","◯","体育系","柔道部","10100209"]
["松本キャンパス","全学","◯","体育系","信州大学学友会剣道部","10100210"]
["松本キャンパス","全学","◯","体育系","全学弓道部","10100211"]
["松本キャンパス","全学","◯","体育系","体操競技部","10100212"]
["松本キャンパス","全学","◯","体育系","競技スキー部","10100213"]
["松本キャンパス","全学","◯","体育系","全学ハンドボール部","10100214"]
["松本キャンパス","全学","◯","体育系","全学男子バスケットボール部","10100215"]
["松本キャンパス","全学","◯","体育系","女子バスケットボール部","10100216"]
["松本キャンパス","全学","◯","体育系","氷上競技部スピードスケート部門","10100217"]
["松本キャンパス","全学","◯","体育系","全学男子バレーボール部","10100218"]
["松本キャンパス","全学","◯","体育系","女子バレーボール部","10100219"]
["松本キャンパス","全学","◯","体育系","全学バドミントン部","10100220"]
["松本キャンパス","全学","◯","体育系","少林寺拳法部","10100221"]
["松本キャンパス","全学","◯","体育系","全学空手道部","10100222"]
["松本キャンパス","全学","◯","体育系","信州大学アメリカンフットボール部WILDCATS","10100223"]
["松本キャンパス","全学","◯","体育系","合気道部","10100224"]
["松本キャンパス","全学","◯","体育系","全学男女ソフトボール部","10100225"]
["松本キャンパス","全学","◯","体育系","アーチェリー部","10100226"]
["松本キャンパス","全学","◯","体育系","自転車競技部","10100227"]
["松本キャンパス","全学","◯","体育系","準硬式野球部","10100228"]
["松本キャンパス","全学","◯","体育系","全学女子サッカー部","10100229"]
["松本キャンパス","全学","◯","体育系","信州大学YOSAKOI祭りサークル和っしょい","10100230"]
["松本キャンパス","全学","◯","体育系","信州大学フェンシング部","10100231"]
["松本キャンパス","全学","◯","体育系","信州大学松本軟式野球部","10100232"]
["松本キャンパス","全学","◯","体育系","LOOSE","10100234"]
["松本キャンパス","全学","◯","体育系","信州大学女子ラクロス部","10100235"]
["松本キャンパス","全学","◯","体育系","男子ラクロス部","10100237"]
["松本キャンパス","全学","◯","体育系","車いすバスケットボール部SEROWS","10100238"]
["松本キャンパス","全学","◯","体育系","氷上競技部アイスホッケー部門","20100205"]
["松本キャンパス","全学","◯","体育系","馬術部","20100219"]
["松本キャンパス","全学",null,"文化系","かしの木",20100101]
["松本キャンパス","全学",null,"文化系","美術研究会",20100102]
["松本キャンパス","全学",null,"文化系","文藝部楓",20100104]
["松本キャンパス","全学",null,"文化系","信州大学自然科学研究会",20100105]
["松本キャンパス","全学",null,"文化系","信州大学トゥルバドゥール",20100107]
["松本キャンパス","全学",null,"文化系","信州大学裏千家茶道部",20100108]
["松本キャンパス","全学",null,"文化系","信州大学アカペラサークルCapel",20100109]
["松本キャンパス","全学",null,"文化系","信州大学らんぷの会",20100111]
["松本キャンパス","全学",null,"文化系","信州大学The Beatles研Q会",20100114]
["松本キャンパス","全学",null,"文化系","信州大学ALL写真部",20100116]
["松本キャンパス","全学",null,"文化系","信州大学　天文俱楽部",20100118]
["松本キャンパス","全学",null,"文化系","信州大学漫画研究会",20100119]
["松本キャンパス","全学",null,"文化系","信州大学劇団山脈",20100120]
["松本キャンパス","全学",null,"文化系","信州大学JAZZ研究会",20100121]
["松本キャンパス","全学",null,"文化系","第二新聞部NOA",20100125]
["松本キャンパス","全学",null,"文化系","Simulation Game研究会",20100127]
["松本キャンパス","全学",null,"文化系","TOSS信州大学",20100128]
["松本キャンパス","全学",null,"文化系","2代目ヒッチハイクサークルのりこみ隊",20100133]
["松本キャンパス","全学",null,"文化系","信州大学ジャグリングサークルサイクロイド",20100138]
["松本キャンパス","全学",null,"文化系","信州大学ケルト音楽研究会 S-celts",20100142]
["松本キャンパス","全学",null,"文化系","書道サークル墨人",20100145]
["松本キャンパス","全学",null,"文化系","昔ながらの田んぼの会",20100149]
["松本キャンパス","全学",null,"文化系","信州大学レトロ音楽俱楽部",20100150]
["松本キャンパス","全学",null,"文化系","信州大学のりものサークル",20100159]
["松本キャンパス","全学",null,"文化系","信州大学クイズサークル",20100160]
["松本キャンパス","全学",null,"文化系","信大回廊",20100168]
["松本キャンパス","全学",null,"文化系","信州大学ポケモンサークル",20100169]
["松本キャンパス","全学",null,"文化系","現代限界芸術研究会",20100178]
["松本キャンパス","全学",null,"文化系","信州大学地域参画プロジェクトCHANGE",20100183]
["松本キャンパス","全学",null,"文化系","シンダイガイド",20100186]
{"$rows_left_out":71}
{"sheet":"医学部団体","index":3,"n_rows":40,"n_cols":8,"rows_kept":40,"cut":false,"hidden":true,"merged":[]}
["所属","全学・医学","学友会","区分","団体名称","サークルマスタ"]
["松本キャンパス","医学部",null,"文化系","医学部軽音楽部","20110101","松本キャンパス"]
["松本キャンパス","医学部",null,"文化系","医学部写真部","20110102","医学部団体"]
["松本キャンパス","医学部",null,"文化系","医学部天文部","20110103","学友会所属団体","学友会に所属していない団体"]
["松本キャンパス","医学部",null,"文化系","メディカル映画研究会","20110104","体育系","文化系"]
["松本キャンパス","医学部",null,"文化系","Medical English Speaking Society","20110105"]
["松本キャンパス","医学部",null,"文化系","Shinshu Advanced Life-support Teams","20110106"]
["松本キャンパス","医学部",null,"文化系","医学部交響楽団","20110107"]
["松本キャンパス","医学部",null,"文化系","わらわら","20110108"]
["松本キャンパス","医学部",null,"文化系","医学部信州大好きクラブ","20110109"]
["松本キャンパス","医学部",null,"文化系","医学部ダンス部","20110110"]
["松本キャンパス","医学部",null,"文化系","MEDICAL HEALTH","20110111"]
["松本キャンパス","医学部",null,"文化系","医学部茶道部","20110113"]
["松本キャンパス","医学部",null,"文化系","MHC","20110115"]
["松本キャンパス","医学部",null,"体育系","信州大学医学部硬式庭球部","20110201"]
["松本キャンパス","医学部",null,"体育系","医学部軟式テニス部","20110202"]
["松本キャンパス","医学部",null,"体育系","医学部男子バレーボール部","20110203"]
["松本キャンパス","医学部",null,"体育系","医学部女子バレーボール部","20110204"]
["松本キャンパス","医学部",null,"体育系","医学部男子バスケットボール部","20110205"]
["松本キャンパス","医学部",null,"体育系","医学部女子バスケットボール部","20110206"]
["松本キャンパス","医学部",null,"体育系","医学部ラグビー部","20110207"]
["松本キャンパス","医学部",null,"体育系","医学部サッカー部","20110208"]
["松本キャンパス","医学部",null,"体育系","医学部硬式野球部","20110209"]
["松本キャンパス","医学部",null,"体育系","医学部ゴルフ部","20110210"]
["松本キャンパス","医学部",null,"体育系","医学部卓球部","20110211"]
["松本キャンパス","医学部",null,"体育系","医学部医短バドミントン部","20110212"]
["松本キャンパス","医学部",null,"体育系","医学部水泳部","20110213"]
["松本キャンパス","医学部",null,"体育系","医学部陸上競技部","20110214"]
["松本キャンパス","医学部",null,"体育系","医学部競技スキー部","20110215"]
["松本キャンパス","医学部",null,"体育系","信州大学医学部馬術部","20110216"]
["松本キャンパス","医学部",null,"体育系","信州大学医学部山岳部","20110217"]
["松本キャンパス","医学部",null,"体育系","医学部弓道部","20110218"]
["松本キャンパス","医学部",null,"体育系","信州大学医学部剣道部","20110219"]
["松本キャンパス","医学部",null,"体育系","医学部空手道部","20110220"]
["松本キャンパス","医学部",null,"体育系","医学部柔道部","20110221"]
["松本キャンパス","医学部",null,"体育系","医学部フットサル部","20110222"]
["松本キャンパス","医学部",null,"体育系","医学部女子卓球部","20110223"]
["松本キャンパス","医学部",null,"体育系","医学部ハンドボール部","20110224"]
["松本キャンパス","医学部",null,"体育系","医学部バーベル部","20110225"]
["松本キャンパス","医学部","◯","文化系","医学部室内楽団",10100112]